BDBM50166034 1-(2,4-Dihydroxy-phenyl)-2-(4-hydroxy-phenyl)-ethanone::2,4,4'-Trihydroxydeoxybenzoin::2,4,4'-terthydroxydeoxybenzoin::CHEMBL193200
SMILES Oc1ccc(CC(=O)c2ccc(O)cc2O)cc1
InChI Key InChIKey=KLFCJXAPIFIIFR-UHFFFAOYSA-N
Data  4 IC50  2 EC50
  Tab Delimited (TSV)   2D SDfile   Computed 3D by Vconf -m prep SDfile
Find this compound or compounds like it in BindingDB:
Activity Spreadsheet -- Enzyme Inhibition Constant Data from BindingDB
Found 6 hits for monomerid = 50166034
TargetSex hormone-binding globulin(Homo sapiens (Human))
University Of British Columbia
Curated by ChEMBL
LigandPNGBDBM50166034(1-(2,4-Dihydroxy-phenyl)-2-(4-hydroxy-phenyl)-etha...)
Affinity DataIC50:  1.36E+4nM. Assay description: Inhibitory concentration against [3H]-DHT binding to human sex hormone-binding globulin (SHBG)
In DepthDetails ArticlePubMed
TargetPolyphenol oxidase 2(Agaricus bisporus (Common mushroom))
National Taiwan University
Curated by ChEMBL
LigandPNGBDBM50166034(1-(2,4-Dihydroxy-phenyl)-2-(4-hydroxy-phenyl)-etha...)
Affinity DataIC50:  1.72E+5nM. Assay description: Inhibition of mushroom tyrosinase activity after 150 mins by spectrophotometry
In DepthDetails ArticlePubMed
TargetEstrogen receptor(Homo sapiens (Human))
East China University Of Science And Technology
Curated by ChEMBL
LigandPNGBDBM50166034(1-(2,4-Dihydroxy-phenyl)-2-(4-hydroxy-phenyl)-etha...)
Affinity DataEC50:  2.03E+3nM. Assay description: Agonist activity at human estrogen receptor-alpha by yeast two-hybrid assay in presence of SRC1
In DepthDetails ArticlePubMed
TargetPolyphenol oxidase 2(Agaricus bisporus (Common mushroom))
National Taiwan University
Curated by ChEMBL
LigandPNGBDBM50166034(1-(2,4-Dihydroxy-phenyl)-2-(4-hydroxy-phenyl)-etha...)
Affinity DataIC50:  1.78E+5nM. Assay description: Inhibition of mushroom tyrosinase activity after 30 mins by spectrophotometry
In DepthDetails ArticlePubMed
TargetEstrogen receptor beta(Homo sapiens (Human))
East China University Of Science And Technology
Curated by ChEMBL
LigandPNGBDBM50166034(1-(2,4-Dihydroxy-phenyl)-2-(4-hydroxy-phenyl)-etha...)
Affinity DataEC50:  500nM. Assay description: Agonist activity at human estrogen receptor-beta by yeast two-hybrid assay in presence of SRC1
In DepthDetails ArticlePubMed
TargetPolyphenol oxidase 2(Agaricus bisporus (Common mushroom))
National Taiwan University
Curated by ChEMBL
LigandPNGBDBM50166034(1-(2,4-Dihydroxy-phenyl)-2-(4-hydroxy-phenyl)-etha...)
Affinity DataIC50:  1.36E+5nM. Assay description: Inhibition of mushroom tyrosinase activity after 90 mins by spectrophotometry
In DepthDetails ArticlePubMed