BDBM50166284 CHEMBL3799919
SMILES [O-][N+](=O)c1ccc2NC(=O)\C(=C3/Nc4cccc(Br)c4C3=O)c2c1
InChI Key InChIKey=QPWNOSITQGGYFW-OWBHPGMISA-N
Data  1 IC50
  Tab Delimited (TSV)   2D SDfile   Computed 3D by Vconf -m prep SDfile
Find this compound or compounds like it in BindingDB:
Activity Spreadsheet -- Enzyme Inhibition Constant Data from BindingDB
Found 1 hit for monomerid = 50166284
TargetSerine/threonine-protein kinase 17B(Homo sapiens (Human))
Korea Research Institute Of Chemical Technology
Curated by ChEMBL
LigandPNGBDBM50166284(CHEMBL3799919)
Affinity DataIC50: >1.00E+4nM. Assay description: Inhibition of DRAK2 (unknown origin) using MRLC3 peptide as substrate incubated for 2 hrs by ADP-Glo kinase assay
In DepthDetails ArticlePubMed