BDBM50166920 CHEMBL3799424
SMILES CC(=O)Nc1ccc(cc1)-c1ncnc2n(C)c(cc12)C(=O)OCc1ccccc1
InChI Key InChIKey=WYIKAQNEFKSBPR-UHFFFAOYSA-N
Data  1 IC50
  Tab Delimited (TSV)   2D SDfile   Computed 3D by Vconf -m prep SDfile
Find this compound or compounds like it in BindingDB:
Activity Spreadsheet -- Enzyme Inhibition Constant Data from BindingDB
Found 1 hit for monomerid = 50166920
TargetTyrosine-protein kinase JAK2(Homo sapiens (Human))
China Pharmaceutical University
Curated by ChEMBL
LigandPNGBDBM50166920(CHEMBL3799424)
Affinity DataIC50:  732nM. Assay description: Inhibition of recombinant human GST-tagged JAK2 expressed in baculovirus expression system using Z'-LYTE Try6 peptide as substrate incubated for 1 hr...
In DepthDetails ArticlePubMed