BDBM50166953 CHEMBL3799559
SMILES CCc1cnc(Oc2ccc(NC(=O)c3ccncc3N)cc2Cl)nc1
InChI Key InChIKey=KSPDJPOUSYZYOV-UHFFFAOYSA-N
Data  1 EC50
  Tab Delimited (TSV)   2D SDfile   Computed 3D by Vconf -m prep SDfile
Find this compound or compounds like it in BindingDB:
Activity Spreadsheet -- Enzyme Inhibition Constant Data from BindingDB
Found 1 hit for monomerid = 50166953
TargetMetabotropic glutamate receptor 4(Homo sapiens (Human))
Vanderbilt University Medical Center
Curated by ChEMBL
LigandPNGBDBM50166953(CHEMBL3799559)
Affinity DataEC50: >1.00E+4nM. Assay description: Positive allosteric modulator activity at human mGlu4 receptor expressed in CHO cells expressing Gqi5 by calcium mobilization assay
In DepthDetails ArticlePubMed