BDBM50166974 CHEMBL3797463
SMILES Nc1cccnc1C(=O)Nc1ccc(N2CCc3ccccc3C2=O)c(Cl)c1
InChI Key InChIKey=ZWSPYAIDAOBFID-UHFFFAOYSA-N
Data  2 EC50
  Tab Delimited (TSV)   2D SDfile   Computed 3D by Vconf -m prep SDfile
Find this compound or compounds like it in BindingDB:
Activity Spreadsheet -- Enzyme Inhibition Constant Data from BindingDB
Found 2 hits for monomerid = 50166974
TargetMetabotropic glutamate receptor 4(Homo sapiens (Human))
Vanderbilt University Medical Center
Curated by ChEMBL
LigandPNGBDBM50166974(CHEMBL3797463)
Affinity DataEC50:  0.921nM. Assay description: Positive allosteric modulator activity at human mGlu4 receptor expressed in CHO cells expressing Gqi5 by calcium mobilization assay
In DepthDetails ArticlePubMed
TargetMetabotropic glutamate receptor 4(Homo sapiens (Human))
Vanderbilt University Medical Center
Curated by ChEMBL
LigandPNGBDBM50166974(CHEMBL3797463)
Affinity DataEC50:  0.921nM. Assay description: Positive allosteric modulator activity at human mGlu4 receptor expressed in CHO cells expressing Gqi5 by calcium mobilization assay
In DepthDetails ArticlePubMed