BDBM50167078 CHEMBL3800198
SMILES Oc1cn(ccc1=O)-c1nccc(c1F)-c1ccccc1
InChI Key InChIKey=GQWSHXNJDYQBLO-UHFFFAOYSA-N
Data  2 IC50
  Tab Delimited (TSV)   2D SDfile   Computed 3D by Vconf -m prep SDfile
Find this compound or compounds like it in BindingDB:
Activity Spreadsheet -- Enzyme Inhibition Constant Data from BindingDB
Found 2 hits for monomerid = 50167078
TargetLanosterol synthase(Rattus norvegicus)
Merck
Curated by ChEMBL
LigandPNGBDBM50167078(CHEMBL3800198)
Affinity DataIC50:  55nM. Assay description: Inhibition of recombinant human C-terminal His6-tagged MB-COMT expressed in Bacmid using SAM/dopamine as substrate preincubated for 2 hrs followed by...
In DepthDetails ArticlePubMed
TargetLanosterol synthase(Rattus norvegicus)
Merck
Curated by ChEMBL
LigandPNGBDBM50167078(CHEMBL3800198)
Affinity DataIC50:  946nM. Assay description: Inhibition of recombinant human C-terminal His6-tagged soluble COMT transfected in Escherichia coli BL21-Gold (DE3) using SAM/dopamine as substrate p...
In DepthDetails ArticlePubMed