BDBM50167144 (4R,5R)-5-[(R)-Hydroxy-(5-methyl-thiophen-2-yl)-methyl]-1-methyl-4-phenyl-pyrrolidin-2-one::CHEMBL360829
SMILES CN1[C@@H]([C@@H](O)c2ccc(C)s2)[C@H](CC1=O)c1ccccc1
InChI Key InChIKey=PGDGZIUTDHOVBL-XYPHTWIQSA-N
Data  1 IC50
  Tab Delimited (TSV)   2D SDfile   Computed 3D by Vconf -m prep SDfile
Find this compound or compounds like it in BindingDB:
Activity Spreadsheet -- Enzyme Inhibition Constant Data from BindingDB
Found 1 hit for monomerid = 50167144
Target17-beta-hydroxysteroid dehydrogenase type 2(Homo sapiens (Human))
Bayer Research Center
Curated by ChEMBL
LigandPNGBDBM50167144((4R,5R)-5-[(R)-Hydroxy-(5-methyl-thiophen-2-yl)-me...)
Affinity DataIC50:  560nM. Assay description: Inhibitory concentration against 17 beta hydroxysteroid dehydrogenase type 2 (type II 17-beta-HSD II)
In DepthDetails ArticlePubMed