BDBM50167145 (4R,5R)-4-(4-Hydroxy-phenyl)-5-[(R)-hydroxy-(5-phenyl-thiophen-2-yl)-methyl]-1-methyl-pyrrolidin-2-one::CHEMBL360217
SMILES CN1[C@@H]([C@@H](O)c2ccc(s2)-c2ccccc2)[C@H](CC1=O)c1ccc(O)cc1
InChI Key InChIKey=ZMRZZQGDXVAKPU-YHYVQYDKSA-N
Data  1 IC50
  Tab Delimited (TSV)   2D SDfile   Computed 3D by Vconf -m prep SDfile
Find this compound or compounds like it in BindingDB:
Activity Spreadsheet -- Enzyme Inhibition Constant Data from BindingDB
Found 1 hit for monomerid = 50167145
Target17-beta-hydroxysteroid dehydrogenase type 2(Homo sapiens (Human))
Bayer Research Center
Curated by ChEMBL
LigandPNGBDBM50167145((4R,5R)-4-(4-Hydroxy-phenyl)-5-[(R)-hydroxy-(5-phe...)
Affinity DataIC50:  220nM. Assay description: Inhibitory concentration against 17 beta hydroxysteroid dehydrogenase type 2 (type II 17-beta-HSD II)
In DepthDetails ArticlePubMed