BDBM50167294 (S)-2-(Cyano-methyl-amino)-propionic acid (S)-2-cyclohexyl-1-methyl-ethyl ester::CHEMBL189842
SMILES C[C@@H](CC1CCCCC1)OC(=O)[C@H](C)N(C)C#N
InChI Key InChIKey=NITPHAADQHSKKD-RYUDHWBXSA-N
Data  1 KI
  Tab Delimited (TSV)   2D SDfile   Computed 3D by Vconf -m prep SDfile
Find this compound or compounds like it in BindingDB:
Activity Spreadsheet -- Enzyme Inhibition Constant Data from BindingDB
Found 1 hit for monomerid = 50167294
TargetCathepsin K(Homo sapiens (Human))
Glaxosmithkline
Curated by ChEMBL
LigandPNGBDBM50167294((S)-2-(Cyano-methyl-amino)-propionic acid (S)-2-cy...)
Affinity DataKi:  2.30E+3nM. Assay description: Inhibition constant against human cathepsin K in fluorescence assay using Cbz-Phe-Arg-AMC
In DepthDetails ArticlePubMed