BDBM50167296 (1S)-2-cyclohexyl-1-methylethyl 2-cyano-2-ethylhydrazinecarboxylate::CHEMBL190544
SMILES CCN(NC(=O)O[C@@H](C)CC1CCCCC1)C#N
InChI Key InChIKey=PYDCJWGJEPYJRR-NSHDSACASA-N
Data  1 KI
  Tab Delimited (TSV)   2D SDfile   Computed 3D by Vconf -m prep SDfile
Find this compound or compounds like it in BindingDB:
Activity Spreadsheet -- Enzyme Inhibition Constant Data from BindingDB
Found 1 hit for monomerid = 50167296
TargetCathepsin K(Homo sapiens (Human))
Glaxosmithkline
Curated by ChEMBL
LigandPNGBDBM50167296((1S)-2-cyclohexyl-1-methylethyl 2-cyano-2-ethylhyd...)
Affinity DataKi:  0.00300nM. Assay description: Inhibition constant against human cathepsin K in fluorescence assay using Cbz-Phe-Arg-AMC
In DepthDetails ArticlePubMed