BDBM50167434 CHEMBL190646::N-[1'-(3,4-Dichloro-benzyl)-[1,4']bipiperidinyl-3-ylmethyl]-2-methoxy-benzamide
SMILES COc1ccccc1C(=O)NCC1CCCN(C1)C1CCN(Cc2ccc(Cl)c(Cl)c2)CC1
InChI Key InChIKey=NWCZSBYBGHIZGJ-UHFFFAOYSA-N
Data  1 KI
  Tab Delimited (TSV)   2D SDfile   Computed 3D by Vconf -m prep SDfile
Find this compound or compounds like it in BindingDB:
Activity Spreadsheet -- Enzyme Inhibition Constant Data from BindingDB
Found 1 hit for monomerid = 50167434
TargetC-C chemokine receptor type 3(Homo sapiens (Human))
Schering-Plough Research Institute
Curated by ChEMBL
LigandPNGBDBM50167434(CHEMBL190646 | N-[1'-(3,4-Dichloro-benzyl)-[1,4']b...)
Affinity DataKi:  92nM. Assay description: In vitro binding activity against C-C chemokine receptor type 3 using [35S]-GTP-gammaS, as radioligand
In DepthDetails ArticlePubMed