BDBM50167619 (2R,5R)-5-Hydroxy-3,3-dimethyl-1-[4-(4-methyl-benzyloxy)-benzenesulfonyl]-piperidine-2-carboxylic acid hydroxyamide::CHEMBL191359
SMILES Cc1ccc(COc2ccc(cc2)S(=O)(=O)N2C[C@H](O)CC(C)(C)[C@@H]2C(=O)NO)cc1
InChI Key InChIKey=ZXORTEVXPYNWIB-XLIONFOSSA-N
Data  3 IC50
  Tab Delimited (TSV)   2D SDfile   Computed 3D by Vconf -m prep SDfile
Find this compound or compounds like it in BindingDB:
Activity Spreadsheet -- Enzyme Inhibition Constant Data from BindingDB
Found 3 hits for monomerid = 50167619
LigandPNGBDBM50167619((2R,5R)-5-Hydroxy-3,3-dimethyl-1-[4-(4-methyl-benz...)
Affinity DataIC50:  11nM. Assay description: Inhibitory concentration against TNF-alpha converting enzyme
In DepthDetails ArticlePubMed
TargetInterstitial collagenase(Homo sapiens (Human))
Pfizer
Curated by ChEMBL
LigandPNGBDBM50167619((2R,5R)-5-Hydroxy-3,3-dimethyl-1-[4-(4-methyl-benz...)
Affinity DataIC50:  198nM. Assay description: Inhibitory concentration against Matrix metalloproteinase-1 (MMP-1)
In DepthDetails ArticlePubMed
TargetCollagenase 3(Homo sapiens (Human))
Pfizer
Curated by ChEMBL
LigandPNGBDBM50167619((2R,5R)-5-Hydroxy-3,3-dimethyl-1-[4-(4-methyl-benz...)
Affinity DataIC50:  1.20nM. Assay description: Inhibitory concentration against Matrix metalloproteinase-13 (MMP-13)
In DepthDetails ArticlePubMed