BDBM50167626 (Z)-2-[(Bicyclo[2.2.1]heptane-2-carbonyl)-amino]-3-[4-(2-bromo-phenoxy)-phenyl]-acrylic acid::CHEMBL192358
SMILES OC(=O)C(\NC(=O)C1CC2CCC1C2)=C\c1ccc(Oc2ccccc2Br)cc1
InChI Key InChIKey=MBUUSJATYBXYKY-MOSHPQCFSA-N
Data  1 IC50
  Tab Delimited (TSV)   2D SDfile   Computed 3D by Vconf -m prep SDfile
Find this compound or compounds like it in BindingDB:
Activity Spreadsheet -- Enzyme Inhibition Constant Data from BindingDB
Found 1 hit for monomerid = 50167626
TargetRNA-directed RNA polymerase(Hepatitis C virus)
Pfizer
Curated by ChEMBL
LigandPNGBDBM50167626((Z)-2-[(Bicyclo[2.2.1]heptane-2-carbonyl)-amino]-3...)
Affinity DataIC50:  100nM. Assay description: Inhibitory concentration against RNA dependent RNA polymerase Nonstructural protein 5B (HCV NS5B polymerase) in Hepatitis C virus
In DepthDetails ArticlePubMed