BDBM50167633 (Z)-2-[(Adamantane-1-carbonyl)-amino]-3-[4-(2-bromo-phenoxy)-phenyl]-acrylic acid::CHEMBL191820
SMILES OC(=O)C(\NC(=O)C12CC3CC(CC(C3)C1)C2)=C\c1ccc(Oc2ccccc2Br)cc1
InChI Key InChIKey=MEFWZNVUKPGNET-UUYOSTAYSA-N
Data  1 IC50
  Tab Delimited (TSV)   2D SDfile   Computed 3D by Vconf -m prep SDfile
Find this compound or compounds like it in BindingDB:
Activity Spreadsheet -- Enzyme Inhibition Constant Data from BindingDB
Found 1 hit for monomerid = 50167633
TargetRNA-directed RNA polymerase(Hepatitis C virus)
Pfizer
Curated by ChEMBL
LigandPNGBDBM50167633((Z)-2-[(Adamantane-1-carbonyl)-amino]-3-[4-(2-brom...)
Affinity DataIC50:  70nM. Assay description: Inhibitory concentration against RNA dependent RNA polymerase Nonstructural protein 5B (HCV NS5B polymerase) in Hepatitis C virus
In DepthDetails ArticlePubMed