BDBM50167826 CHEMBL3798995
SMILES N[C@@H](Cc1ccc(cc1)C(=O)\N=C(/N)NCc1ccccc1N1CCCCCC1)C(O)=O
InChI Key InChIKey=FQMHFMODYXYION-FQEVSTJZSA-N
Data  1 IC50
  Tab Delimited (TSV)   2D SDfile   Computed 3D by Vconf -m prep SDfile
Find this compound or compounds like it in BindingDB:
Activity Spreadsheet -- Enzyme Inhibition Constant Data from BindingDB
Found 1 hit for monomerid = 50167826
TargetTryptophan 5-hydroxylase 1(Homo sapiens (Human))
Karos Pharmaceuticals
Curated by ChEMBL
LigandPNGBDBM50167826(CHEMBL3798995)
Affinity DataIC50:  16nM. Assay description: Inhibition of TPH1 (unknown origin)
In DepthDetails ArticlePubMed