BDBM50167984 CHEMBL370493::K-252a analogue
SMILES CC1(C)O[C@H](C[C@@]1(O)CO)n1c2ccccc2c2c3C(=O)NCc3c3c4ccccc4[nH]c3c12
InChI Key InChIKey=ONSKSKMJNHEONW-XHCCPWGMSA-N
Data  2 IC50
  Tab Delimited (TSV)   2D SDfile   Computed 3D by Vconf -m prep SDfile
Find this compound or compounds like it in BindingDB:
Activity Spreadsheet -- Enzyme Inhibition Constant Data from BindingDB
Found 2 hits for monomerid = 50167984
TargetHigh affinity nerve growth factor receptor(Homo sapiens (Human))
Cephalon
Curated by ChEMBL
LigandPNGBDBM50167984(CHEMBL370493 | K-252a analogue)
Affinity DataIC50:  4nM. Assay description: Inhibition of baculovirus expressed human trkA
In DepthDetails ArticlePubMed
TargetVascular endothelial growth factor receptor 2(Homo sapiens (Human))
Cephalon
Curated by ChEMBL
LigandPNGBDBM50167984(CHEMBL370493 | K-252a analogue)
Affinity DataIC50:  4nM. Assay description: Inhibition of baculovirus expressed human VEGFR2
In DepthDetails ArticlePubMed