BDBM50167998 CHEMBL370687::Indan::indane
SMILES C1Cc2ccccc2C1
InChI Key InChIKey=PQNFLJBBNBOBRQ-UHFFFAOYSA-N
Data  1 IC50
PDB links: 3 PDB IDs match this monomer.
  Tab Delimited (TSV)   2D SDfile   Computed 3D by Vconf -m prep SDfile
Find this compound or compounds like it in BindingDB:
Activity Spreadsheet -- Enzyme Inhibition Constant Data from BindingDB
Found 1 hit for monomerid = 50167998
TargetCytochrome P450 1A2(Homo sapiens (Human))
University Of Kuopio
Curated by ChEMBL
LigandPNGBDBM50167998(CHEMBL370687 | Indan | indane)
Affinity DataIC50:  5.50E+5nM. Assay description: Inhibitory concentration against recombinant human cytochrome P450 1A2
In DepthDetails ArticlePubMed