BDBM50168073 CHEMBL3798819
SMILES CN(C)CCCN1c2ccccc2CCc2ccc(cc12)C#CCOCCOc1cccc2ccccc12
InChI Key InChIKey=DHFNHCUTHIREFU-UHFFFAOYSA-N
Data  3 KI  1 IC50
  Tab Delimited (TSV)   2D SDfile   Computed 3D by Vconf -m prep SDfile
Find this compound or compounds like it in BindingDB:
Activity Spreadsheet -- Enzyme Inhibition Constant Data from BindingDB
Found 4 hits for monomerid = 50168073
TargetSodium-dependent serotonin transporter(Homo sapiens (Human))
Aarhus University
Curated by ChEMBL
LigandPNGBDBM50168073(CHEMBL3798819)
Affinity DataKi:  1.80E+3nM. Assay description: Inhibition of human SERT I179C mutant expressed in HEK293 MSR cells assessed as [3H]-5-HT uptake preincubated for 30 mins followed addition of [3H]-5...
In DepthDetails ArticlePubMed
TargetSodium-dependent serotonin transporter(Homo sapiens (Human))
Aarhus University
Curated by ChEMBL
LigandPNGBDBM50168073(CHEMBL3798819)
Affinity DataKi:  3.50E+3nM. Assay description: Inhibition of wild-type human SERT expressed in HEK293 MSR cells assessed as [3H]-5-HT uptake preincubated for 30 mins followed addition of [3H]-5HT ...
In DepthDetails ArticlePubMed
TargetSodium-dependent serotonin transporter(Homo sapiens (Human))
Aarhus University
Curated by ChEMBL
LigandPNGBDBM50168073(CHEMBL3798819)
Affinity DataKi:  8.00E+3nM. Assay description: Inhibition of human SERT I172M mutant expressed in HEK293 MSR cells assessed as [3H]-5-HT uptake preincubated for 30 mins followed addition of [3H]-5...
In DepthDetails ArticlePubMed
TargetSodium-dependent serotonin transporter(Homo sapiens (Human))
Aarhus University
Curated by ChEMBL
LigandPNGBDBM50168073(CHEMBL3798819)
Affinity DataIC50:  4.80E+3nM. Assay description: Inhibition of human SERT W103A mutant expressed in HEK293 MSR cells assessed as [3H]-5-HT uptake preincubated for 30 mins followed addition of [3H]-5...
In DepthDetails ArticlePubMed