BDBM50168122 CHEMBL3797324
SMILES Nc1nc(nc2cn(Cc3ccccc3)nc12)-c1ccco1
InChI Key InChIKey=WHRXEWMAKBKKKJ-UHFFFAOYSA-N
Data  1 KI
  Tab Delimited (TSV)   2D SDfile   Computed 3D by Vconf -m prep SDfile
Find this compound or compounds like it in BindingDB:
Activity Spreadsheet -- Enzyme Inhibition Constant Data from BindingDB
Found 1 hit for monomerid = 50168122
TargetAdenosine receptor A2a(Homo sapiens (Human))
Universit£
Curated by ChEMBL
LigandPNGBDBM50168122(CHEMBL3797324)
Affinity DataKi:  320nM. Assay description: Displacement of [3H]-ZM241385 from human adenosine A2A receptor expressed in CHO cell membranes after 60 mins by scintillation counting method
In DepthDetails ArticlePubMed