BDBM50168202 2-{4-[5-(4-Fluoro-phenyl)-4-pyridin-4-yl-1H-pyrrol-2-yl]-piperidin-1-yl}-ethylamine::CHEMBL191252
SMILES NCCN1CCC(CC1)c1cc(c([nH]1)-c1ccc(F)cc1)-c1ccncc1
InChI Key InChIKey=LRRARKXBWLYEDH-UHFFFAOYSA-N
Data  1 IC50
  Tab Delimited (TSV)   2D SDfile   Computed 3D by Vconf -m prep SDfile
Find this compound or compounds like it in BindingDB:
Activity Spreadsheet -- Enzyme Inhibition Constant Data from BindingDB
Found 1 hit for monomerid = 50168202
TargetcGMP-dependent protein kinase(Eimeria tenella)
Merck Research Laboratories
Curated by ChEMBL
LigandPNGBDBM50168202(2-{4-[5-(4-Fluoro-phenyl)-4-pyridin-4-yl-1H-pyrrol...)
Affinity DataIC50:  0.280nM. Assay description: In vitro inhibition of Eimeria tenella cGMP-dependent protein kinase
In DepthDetails ArticlePubMed