BDBM50168216 CHEMBL3806006
SMILES [H][C@@]12CCC(=O)[C@@]1(C)CC[C@]1([H])c3ccc(cc3CC[C@@]21[H])B(O)O
InChI Key InChIKey=QRKAJBMQQQHJPK-CBZIJGRNSA-N
Data  1 KI
  Tab Delimited (TSV)   2D SDfile   Computed 3D by Vconf -m prep SDfile
Find this compound or compounds like it in BindingDB:
Activity Spreadsheet -- Enzyme Inhibition Constant Data from BindingDB
Found 1 hit for monomerid = 50168216
TargetSteryl-sulfatase(Homo sapiens (Human))
Punjabi University
Curated by ChEMBL
LigandPNGBDBM50168216(CHEMBL3806006)
Affinity DataKi:  2.80E+3nM. Assay description: Reversible inhibition of human estrone sulfatase using 4-methylumbelliferyl sulfate as substrate by fluorimetric assay
In DepthDetails ArticlePubMed