BDBM50168357 6-Phenyl-naphthalen-2-ol::6-phenyl-2-naphthol::CHEMBL191714
SMILES Oc1ccc2cc(ccc2c1)-c1ccccc1
InChI Key InChIKey=PZOXFBPKKGTQDZ-UHFFFAOYSA-N
Data  2 IC50
  Tab Delimited (TSV)   2D SDfile   Computed 3D by Vconf -m prep SDfile
Find this compound or compounds like it in BindingDB:
Activity Spreadsheet -- Enzyme Inhibition Constant Data from BindingDB
Found 2 hits for monomerid = 50168357
TargetEstrogen receptor(Homo sapiens (Human))
Wyeth Research
Curated by ChEMBL
LigandPNGBDBM50168357(6-Phenyl-naphthalen-2-ol | 6-phenyl-2-naphthol | C...)
Affinity DataIC50:  1.35E+3nM. Assay description: Inhibition of [3H]-17-beta-estradiol binding to human estrogen receptor alpha expressed in Escherichia coli
In DepthDetails ArticlePubMed
TargetEstrogen receptor beta(Homo sapiens (Human))
Wyeth Research
Curated by ChEMBL
LigandPNGBDBM50168357(6-Phenyl-naphthalen-2-ol | 6-phenyl-2-naphthol | C...)
Affinity DataIC50:  374nM. Assay description: Inhibition of [3H]-17-beta-estradiol binding to human estrogen receptor beta expressed in Escherichia coli
In DepthDetails ArticlePubMed