BDBM50168476 1-(3-Isopropoxy-propyl)-7-methyl-5-(1-propyl-butyl)-1,3,4,5-tetrahydro-1,5,8-triaza-acenaphthylene::CHEMBL191650
SMILES CCCC(CCC)N1CCc2cn(CCCOC(C)C)c3nc(C)cc1c23
InChI Key InChIKey=JLKRRJHFBRMGJB-UHFFFAOYSA-N
Data  1 KI
  Tab Delimited (TSV)   2D SDfile   Computed 3D by Vconf -m prep SDfile
Find this compound or compounds like it in BindingDB:
Activity Spreadsheet -- Enzyme Inhibition Constant Data from BindingDB
Found 1 hit for monomerid = 50168476
TargetCorticotropin-releasing factor receptor 1(Homo sapiens (Human))
Neurocrine Biosciences
Curated by ChEMBL
LigandPNGBDBM50168476(1-(3-Isopropoxy-propyl)-7-methyl-5-(1-propyl-butyl...)
Affinity DataKi:  4.10E+3nM. Assay description: Inhibition of [125I]sauvagine binding to corticotropin releasing factor receptor 1 expressed in LtK- cells
In DepthDetails ArticlePubMed