BDBM50168583 1-[2-(4-Amino-furazan-3-yl)-1-ethyl-1H-benzoimidazol-5-yl]-ethanone::CHEMBL364990
SMILES CCn1c(nc2cc(ccc12)C(C)=O)-c1nonc1N
InChI Key InChIKey=PUJFLPWFPLKMPM-UHFFFAOYSA-N
Data  1 IC50
  Tab Delimited (TSV)   2D SDfile   Computed 3D by Vconf -m prep SDfile
Find this compound or compounds like it in BindingDB:
Activity Spreadsheet -- Enzyme Inhibition Constant Data from BindingDB
Found 1 hit for monomerid = 50168583
TargetRibosomal protein S6 kinase alpha-5(Homo sapiens (Human))
Glaxosmithkline
Curated by ChEMBL
LigandPNGBDBM50168583(1-[2-(4-Amino-furazan-3-yl)-1-ethyl-1H-benzoimidaz...)
Affinity DataIC50:  4.39E+3nM. Assay description: Inhibitory concentration exhibited towards MSK-1
In DepthDetails ArticlePubMed