BDBM50168747 (2R,3R)-3-Hydroxy-3-methyl-1-[4-(2-methyl-pyridin-3-ylmethoxy)-benzenesulfonyl]-piperidine-2-carboxylic acid hydroxyamide::CHEMBL186743
SMILES Cc1ncccc1COc1ccc(cc1)S(=O)(=O)N1CCC[C@@](C)(O)[C@@H]1C(=O)NO
InChI Key InChIKey=OIJUXVJLPZUPIP-AZUAARDMSA-N
Data  3 IC50
  Tab Delimited (TSV)   2D SDfile   Computed 3D by Vconf -m prep SDfile
Find this compound or compounds like it in BindingDB:
Activity Spreadsheet -- Enzyme Inhibition Constant Data from BindingDB
Found 3 hits for monomerid = 50168747
LigandPNGBDBM50168747((2R,3R)-3-Hydroxy-3-methyl-1-[4-(2-methyl-pyridin-...)
Affinity DataIC50:  3.30nM. Assay description: Inhibitory concentration against TNF-alpha release in LPS treated whole blood
In DepthDetails ArticlePubMed
TargetInterstitial collagenase(Homo sapiens (Human))
Pomona College
Curated by ChEMBL
LigandPNGBDBM50168747((2R,3R)-3-Hydroxy-3-methyl-1-[4-(2-methyl-pyridin-...)
Affinity DataIC50:  1.59E+3nM. Assay description: Inhibition of MMP1
In DepthDetails ArticlePubMed
TargetInterstitial collagenase(Homo sapiens (Human))
Pomona College
Curated by ChEMBL
LigandPNGBDBM50168747((2R,3R)-3-Hydroxy-3-methyl-1-[4-(2-methyl-pyridin-...)
Affinity DataIC50:  1.60E+3nM. Assay description: Inhibitory concentration against MMP-1
In DepthDetails ArticlePubMed