BDBM50168757 (2R,3R)-1-[4-(4-Chloro-2-fluoro-benzyloxy)-benzenesulfonyl]-3-hydroxy-3-methyl-piperidine-2-carboxylic acid hydroxyamide::CHEMBL360854
SMILES C[C@@]1(O)CCCN([C@H]1C(=O)NO)S(=O)(=O)c1ccc(OCc2ccc(Cl)cc2F)cc1
InChI Key InChIKey=XMQNILGYVCROEB-AZUAARDMSA-N
Data  3 IC50
  Tab Delimited (TSV)   2D SDfile   Computed 3D by Vconf -m prep SDfile
Find this compound or compounds like it in BindingDB:
Activity Spreadsheet -- Enzyme Inhibition Constant Data from BindingDB
Found 3 hits for monomerid = 50168757
LigandPNGBDBM50168757((2R,3R)-1-[4-(4-Chloro-2-fluoro-benzyloxy)-benzene...)
Affinity DataIC50:  73nM. Assay description: Inhibitory concentration against TNF-alpha release in LPS treated whole blood
In DepthDetails ArticlePubMed
TargetInterstitial collagenase(Homo sapiens (Human))
Pomona College
Curated by ChEMBL
LigandPNGBDBM50168757((2R,3R)-1-[4-(4-Chloro-2-fluoro-benzyloxy)-benzene...)
Affinity DataIC50:  120nM. Assay description: Inhibition of MMP1
In DepthDetails ArticlePubMed
TargetInterstitial collagenase(Homo sapiens (Human))
Pomona College
Curated by ChEMBL
LigandPNGBDBM50168757((2R,3R)-1-[4-(4-Chloro-2-fluoro-benzyloxy)-benzene...)
Affinity DataIC50:  120nM. Assay description: Inhibitory concentration against MMP-1
In DepthDetails ArticlePubMed