BDBM50168941 CHEMBL3804928
SMILES OC(=O)CCn1cc(COC[C@H](NC(=O)[C@H](Cc2ccccc2)NC(=O)OCc2ccccc2)C#N)nn1
InChI Key InChIKey=JYIZNXQVPSOTAR-GGAORHGYSA-N
Data  4 KI
  Tab Delimited (TSV)   2D SDfile   Computed 3D by Vconf -m prep SDfile
Find this compound or compounds like it in BindingDB:
Activity Spreadsheet -- Enzyme Inhibition Constant Data from BindingDB
Found 4 hits for monomerid = 50168941
TargetProcathepsin L(Homo sapiens (Human))
University Of Bonn
Curated by ChEMBL
LigandPNGBDBM50168941(CHEMBL3804928)
Affinity DataKi:  1.30nM. Assay description: Inhibition of human liver cathepsin L using Cbz-Phe-Arg-pNA as substrate incubated for 30 mins measured for 20 mins by photometrical analysis
In DepthDetails ArticlePubMed
TargetCathepsin K(Homo sapiens (Human))
University Of Bonn
Curated by ChEMBL
LigandPNGBDBM50168941(CHEMBL3804928)
Affinity DataKi:  370nM. Assay description: Inhibition of human recombinant cathepsin K using Cbz-Leu-Arg-AMC as substrate incubated for 30 mins measured for 20 mins by spectrofluorometrical an...
In DepthDetails ArticlePubMed
TargetCathepsin S(Homo sapiens (Human))
University Of Bonn
Curated by ChEMBL
LigandPNGBDBM50168941(CHEMBL3804928)
Affinity DataKi:  2.25E+3nM. Assay description: Inhibition of human recombinant cathepsin S using Cbz-Phe-Arg-AMC as substrate incubated for 60 mins measured for 20 mins by spectrofluorometrical an...
In DepthDetails ArticlePubMed
TargetCathepsin B(Homo sapiens (Human))
University Of Bonn
Curated by ChEMBL
LigandPNGBDBM50168941(CHEMBL3804928)
Affinity DataKi:  3.30E+4nMpH: 6.0Assay Description:Inhibition of human liver cathepsin B using Cbz-Arg-Arg-pNA as substrate at pH 6 incubated for 30 mins measured for 20 mins by photometrical analysis
In DepthDetails ArticlePubMed