BDBM50168945 CHEMBL3805060
SMILES OC(=O)CCn1cc(COCC[C@H](NC(=O)[C@H](Cc2ccccc2)NC(=O)OCc2ccccc2)C#N)nn1
InChI Key InChIKey=JSLMHYSMBOKPPU-UPVQGACJSA-N
Data  4 KI
  Tab Delimited (TSV)   2D SDfile   Computed 3D by Vconf -m prep SDfile
Find this compound or compounds like it in BindingDB:
Activity Spreadsheet -- Enzyme Inhibition Constant Data from BindingDB
Found 4 hits for monomerid = 50168945
TargetCathepsin K(Homo sapiens (Human))
University Of Bonn
Curated by ChEMBL
LigandPNGBDBM50168945(CHEMBL3805060)
Affinity DataKi:  370nM. Assay description: Inhibition of human recombinant cathepsin K using Cbz-Leu-Arg-AMC as substrate incubated for 30 mins measured for 20 mins by spectrofluorometrical an...
In DepthDetails ArticlePubMed
TargetCathepsin S(Homo sapiens (Human))
University Of Bonn
Curated by ChEMBL
LigandPNGBDBM50168945(CHEMBL3805060)
Affinity DataKi:  490nM. Assay description: Inhibition of human recombinant cathepsin S using Cbz-Phe-Arg-AMC as substrate incubated for 60 mins measured for 20 mins by spectrofluorometrical an...
In DepthDetails ArticlePubMed
TargetProcathepsin L(Homo sapiens (Human))
University Of Bonn
Curated by ChEMBL
LigandPNGBDBM50168945(CHEMBL3805060)
Affinity DataKi:  1.92E+3nM. Assay description: Inhibition of human liver cathepsin L using Cbz-Phe-Arg-pNA as substrate incubated for 30 mins measured for 20 mins by photometrical analysis
In DepthDetails ArticlePubMed
TargetCathepsin B(Homo sapiens (Human))
University Of Bonn
Curated by ChEMBL
LigandPNGBDBM50168945(CHEMBL3805060)
Affinity DataKi:  1.96E+5nMpH: 6.0Assay Description:Inhibition of human liver cathepsin B using Cbz-Arg-Arg-pNA as substrate at pH 6 incubated for 30 mins measured for 20 mins by photometrical analysis
In DepthDetails ArticlePubMed