BDBM50169121 (S)-2-{[(S)-1-((S)-2-Amino-propionyl)-pyrrolidine-2-carbonyl]-amino}-4-methyl-pentanoic acid::CHEMBL188505
SMILES CC(C)C[C@H](NC(=O)[C@@H]1CCCN1C(=O)[C@H](C)N)C(O)=O
InChI Key InChIKey=ADSGHMXEAZJJNF-DCAQKATOSA-N
Data  1 KI
  Tab Delimited (TSV)   2D SDfile   Computed 3D by Vconf -m prep SDfile
Find this compound or compounds like it in BindingDB:
Activity Spreadsheet -- Enzyme Inhibition Constant Data from BindingDB
Found 1 hit for monomerid = 50169121
TargetSolute carrier family 15 member 1(Homo sapiens (Human))
Martin-Luther-University Halle-Wittenberg
Curated by ChEMBL
LigandPNGBDBM50169121((S)-2-{[(S)-1-((S)-2-Amino-propionyl)-pyrrolidine-...)
Affinity DataKi:  1.50E+5nM. Assay description: Binding affinity against membrane transport protein PEPT1 in human Caco-2 cells
In DepthDetails ArticlePubMed