BDBM50169363 3-Fluoro-5-(2-oxo-3-phenyl-2,3-dihydro-1H-benzoimidazol-5-yl)-benzonitrile::CHEMBL370891
SMILES Fc1cc(cc(c1)-c1ccc2[nH]c(=O)n(-c3ccccc3)c2c1)C#N
InChI Key InChIKey=UVJHHVUGFWINDC-UHFFFAOYSA-N
Data  1 IC50
  Tab Delimited (TSV)   2D SDfile   Computed 3D by Vconf -m prep SDfile
Find this compound or compounds like it in BindingDB:
Activity Spreadsheet -- Enzyme Inhibition Constant Data from BindingDB
Found 1 hit for monomerid = 50169363
TargetProgesterone receptor(Homo sapiens (Human))
Wyeth Research
Curated by ChEMBL
LigandPNGBDBM50169363(3-Fluoro-5-(2-oxo-3-phenyl-2,3-dihydro-1H-benzoimi...)
Affinity DataIC50:  137nM. Assay description: Progesterone receptor agonist activity in human T47D breast carcinoma cell alkaline phosphatase assay
In DepthDetails ArticlePubMed