BDBM50169485 CHEMBL188929::[(S)-1-(Pyridin-2-ylaminooxalyl)-pentyl]-carbamic acid (S)-2,2-dimethyl-1-[3-(4-trifluoromethyl-phenyl)-pyrazol-1-ylmethyl]-propyl ester
SMILES CCCC[C@H](NC(=O)O[C@H](Cn1ccc(n1)-c1ccc(cc1)C(F)(F)F)C(C)(C)C)C(=O)C(=O)Nc1ccccn1
InChI Key InChIKey=FTMVKLBMILBPTA-XZOQPEGZSA-N
Data  5 IC50
  Tab Delimited (TSV)   2D SDfile   Computed 3D by Vconf -m prep SDfile
Find this compound or compounds like it in BindingDB:
Activity Spreadsheet -- Enzyme Inhibition Constant Data from BindingDB
Found 5 hits for monomerid = 50169485
TargetCathepsin K(Homo sapiens (Human))
Glaxosmithkline
Curated by ChEMBL
LigandPNGBDBM50169485(CHEMBL188929 | [(S)-1-(Pyridin-2-ylaminooxalyl)-pe...)
Affinity DataIC50:  8.10E+3nM. Assay description: Inhibition of 10 lM Cbz-Phe-Arg-AMC binding to human cathepsin K in fluorescence assay with 100 mM NaOAc
In DepthDetails ArticlePubMed
TargetCathepsin S(Homo sapiens (Human))
Glaxosmithkline
Curated by ChEMBL
LigandPNGBDBM50169485(CHEMBL188929 | [(S)-1-(Pyridin-2-ylaminooxalyl)-pe...)
Affinity DataIC50:  3.70E+3nM. Assay description: Inhibition of 10 lM Cbz-Val-Val-Arg-AMC binding to human cathepsin S in fluorescence assay with 100 mM NaOAc
In DepthDetails ArticlePubMed
TargetCathepsin B(Homo sapiens (Human))
Glaxosmithkline
Curated by ChEMBL
LigandPNGBDBM50169485(CHEMBL188929 | [(S)-1-(Pyridin-2-ylaminooxalyl)-pe...)
Affinity DataIC50:  1.07E+5nM. Assay description: Inhibition of 10 lM Cbz-Phe-Arg-AMC binding to human cathepsin B activity in fluorescence assay with 100 mM NaOAc
In DepthDetails ArticlePubMed
TargetCathepsin L2(Homo sapiens (Human))
Glaxosmithkline
Curated by ChEMBL
LigandPNGBDBM50169485(CHEMBL188929 | [(S)-1-(Pyridin-2-ylaminooxalyl)-pe...)
Affinity DataIC50:  4.50E+3nM. Assay description: Inhibition of 2 lM Cbz-Phe-Arg-AMC binding to human cathepsin V activity in fluorescence assay with 100 mM NaOAc
In DepthDetails ArticlePubMed
TargetProcathepsin L(Homo sapiens (Human))
Glaxosmithkline
Curated by ChEMBL
LigandPNGBDBM50169485(CHEMBL188929 | [(S)-1-(Pyridin-2-ylaminooxalyl)-pe...)
Affinity DataIC50:  2.40E+5nM. Assay description: Inhibition of 5 lM Cbz-Phe-Arg-AMC bindign to human cathepsin L activity in fluorescence assay with 100 mM NaOAc
In DepthDetails ArticlePubMed