BDBM50169741 CHEMBL3805612
SMILES COC(=O)c1c(O)cc(O)c(Cl)c1CCc1nccn1Cc1occc1C=C
InChI Key InChIKey=WQFNQDJZYVMXNN-UHFFFAOYSA-N
Data  2 Kd
  Tab Delimited (TSV)   2D SDfile   Computed 3D by Vconf -m prep SDfile
Find this compound or compounds like it in BindingDB:
Activity Spreadsheet -- Enzyme Inhibition Constant Data from BindingDB
Found 2 hits for monomerid = 50169741
TargetEndoplasmin(Homo sapiens (Human))
The University Of Kansas
Curated by ChEMBL
LigandPNGBDBM50169741(CHEMBL3805612)
Affinity DataKd:  2.36E+3nM. Assay description: Apparent binding affinity to Grp94 (unknown origin) after 24 hrs by fluorescence polarization assay using FITC-GDA as tracer
In DepthDetails ArticlePubMed
TargetHeat shock protein HSP 90-alpha(Homo sapiens (Human))
The University Of Kansas
Curated by ChEMBL
LigandPNGBDBM50169741(CHEMBL3805612)
Affinity DataKd:  7.50E+3nM. Assay description: Apparent binding affinity to Hsp90alpha (unknown origin) after 24 hrs by fluorescence polarization assay using FITC-GDA as tracer
In DepthDetails ArticlePubMed