BDBM50169757 Benzoic acid 4-(2-methyl-benzoyl)-phenyl ester::CHEMBL425541
SMILES Cc1ccc(cc1)C(=O)Oc1ccc(cc1C)C(=O)c1ccccc1C
InChI Key InChIKey=VWAUJIOSZXJQCT-UHFFFAOYSA-N
Data  3 IC50
  Tab Delimited (TSV)   2D SDfile   Computed 3D by Vconf -m prep SDfile
Find this compound or compounds like it in BindingDB:
Activity Spreadsheet -- Enzyme Inhibition Constant Data from BindingDB
Found 3 hits for monomerid = 50169757
TargetBasic phospholipase A2 PLA-A(Trimeresurus flavoviridis)
University Of Mysore
Curated by ChEMBL
LigandPNGBDBM50169757(Benzoic acid 4-(2-methyl-benzoyl)-phenyl ester | C...)
Affinity DataIC50:  7.50E+4nM. Assay description: In vitro inhibitory concentration against phospholipase A2 of Trimeresurus flavoviridis venom
In DepthDetails ArticlePubMed
TargetAcidic phospholipase A2 EC-I(Echis carinatus)
University Of Mysore
Curated by ChEMBL
LigandPNGBDBM50169757(Benzoic acid 4-(2-methyl-benzoyl)-phenyl ester | C...)
Affinity DataIC50:  8.70E+4nM. Assay description: In vitro inhibitory concentration against phospholipase A2 of Echis carinatus venom
In DepthDetails ArticlePubMed
TargetBasic phospholipase A2 1(Naja melanoleuca)
University Of Mysore
Curated by ChEMBL
LigandPNGBDBM50169757(Benzoic acid 4-(2-methyl-benzoyl)-phenyl ester | C...)
Affinity DataIC50:  7.30E+4nM. Assay description: In vitro inhibitory concentration against phospholipase A2 of Naja melanoleuca venom
In DepthDetails ArticlePubMed