BDBM50169791 (S)-3-Isopropylamino-1-(naphthalen-1-yloxy)-butan-2-ol::CHEMBL178125
SMILES CC(C)N[C@@H](C)C(O)COc1cccc2ccccc12
InChI Key InChIKey=CILPUBLECPRREJ-KNVGNIICSA-N
Data  1 IC50
  Tab Delimited (TSV)   2D SDfile   Computed 3D by Vconf -m prep SDfile
Find this compound or compounds like it in BindingDB:
Activity Spreadsheet -- Enzyme Inhibition Constant Data from BindingDB
Found 1 hit for monomerid = 50169791
TargetCytochrome P450 2D6(Homo sapiens (Human))
Bristol-Myers Squibb Pharmaceutical Research Institute
Curated by ChEMBL
LigandPNGBDBM50169791((S)-3-Isopropylamino-1-(naphthalen-1-yloxy)-butan-...)
Affinity DataIC50:  3.80E+3nM. Assay description: Inhibitory activity against recombinant human Cytochrome P450 2D6 (CYP2D6) after incubated for 45 minutes
In DepthDetails ArticlePubMed