BDBM50169805 1-Isopropylamino-3-(6-methoxy-naphthalen-1-yloxy)-propan-2-ol::CHEMBL360096
SMILES COc1ccc2c(OCC(O)CNC(C)C)cccc2c1
InChI Key InChIKey=NYMXVBIZRYJLOY-UHFFFAOYSA-N
Data  1 IC50
  Tab Delimited (TSV)   2D SDfile   Computed 3D by Vconf -m prep SDfile
Find this compound or compounds like it in BindingDB:
Activity Spreadsheet -- Enzyme Inhibition Constant Data from BindingDB
Found 1 hit for monomerid = 50169805
TargetCytochrome P450 2D6(Homo sapiens (Human))
Bristol-Myers Squibb Pharmaceutical Research Institute
Curated by ChEMBL
LigandPNGBDBM50169805(1-Isopropylamino-3-(6-methoxy-naphthalen-1-yloxy)-...)
Affinity DataIC50:  8.40E+3nM. Assay description: Inhibitory activity against recombinant human Cytochrome P450 2D6 (CYP2D6) after incubated for 45 minutes
In DepthDetails ArticlePubMed