BDBM50169877 CHEMBL3805920
SMILES COC(=O)c1c(O)cc(O)c(Cl)c1CCc1nccn1Cc1cccc(F)c1
InChI Key InChIKey=GOFBLFCMMMVTPI-VIBGGCSXSA-N
Data  2 Kd
  Tab Delimited (TSV)   2D SDfile   Computed 3D by Vconf -m prep SDfile
Find this compound or compounds like it in BindingDB:
Activity Spreadsheet -- Enzyme Inhibition Constant Data from BindingDB
Found 2 hits for monomerid = 50169877
TargetHeat shock protein HSP 90-alpha(Homo sapiens (Human))
The University Of Kansas
Curated by ChEMBL
LigandPNGBDBM50169877(CHEMBL3805920)
Affinity DataKd:  9.63E+3nM. Assay description: Apparent binding affinity to Hsp90alpha (unknown origin) after 24 hrs by fluorescence polarization assay using FITC-GDA as tracer
In DepthDetails ArticlePubMed
TargetEndoplasmin(Homo sapiens (Human))
The University Of Kansas
Curated by ChEMBL
LigandPNGBDBM50169877(CHEMBL3805920)
Affinity DataKd:  1.53E+3nM. Assay description: Apparent binding affinity to Grp94 (unknown origin) after 24 hrs by fluorescence polarization assay using FITC-GDA as tracer
In DepthDetails ArticlePubMed