BDBM50170052 CHEMBL189913::Nonanoic acid 2-acetylamino-4-hydroxy-3-methoxy-benzylamide
SMILES CCCCCCCCC(=O)NCc1ccc(O)c(OC)c1NC(C)=O
InChI Key InChIKey=INZGNWFXQYWYIL-UHFFFAOYSA-N
Data  1 IC50
  Tab Delimited (TSV)   2D SDfile   Computed 3D by Vconf -m prep SDfile
Find this compound or compounds like it in BindingDB:
Activity Spreadsheet -- Enzyme Inhibition Constant Data from BindingDB
Found 1 hit for monomerid = 50170052
TargetTransient receptor potential cation channel subfamily V member 1(Homo sapiens (Human))
University Of Piemonte Orientale
Curated by ChEMBL
LigandPNGBDBM50170052(CHEMBL189913 | Nonanoic acid 2-acetylamino-4-hydro...)
Affinity DataIC50:  9.54E+3nM. Assay description: Inhibition of 100 nM capsaicin effect on intracellular [Ca2+] concentration in HEK293 cells expressing human TRPV1
In DepthDetails ArticlePubMed