BDBM50170228 CHEMBL3804953
SMILES Brc1ccnc2[nH]c(=O)c(=O)[nH]c12
InChI Key InChIKey=GOYADDVNEFFQRY-UHFFFAOYSA-N
Data  3 IC50
  Tab Delimited (TSV)   2D SDfile   Computed 3D by Vconf -m prep SDfile
Find this compound or compounds like it in BindingDB:
Activity Spreadsheet -- Enzyme Inhibition Constant Data from BindingDB
Found 3 hits for monomerid = 50170228
TargetD-amino-acid oxidase(Homo sapiens (Human))
Shanghai Jiao Tong University
Curated by ChEMBL
LigandPNGBDBM50170228(CHEMBL3804953)
Affinity DataIC50:  230nM. Assay description: Inhibition of human recombinant DAAO using D-alanine as substrate assessed as pyruvate production incubated for 60 mins by microplate reader analysis
In DepthDetails ArticlePubMed
TargetD-amino-acid oxidase(Sus scrofa (pig))
Shanghai Jiao Tong University
Curated by ChEMBL
LigandPNGBDBM50170228(CHEMBL3804953)
Affinity DataIC50:  220nM. Assay description: Inhibition of DAAO in porcine kidney homogenate using D-alanine as substrate assessed as pyruvate production incubated for 5 mins by microplate reade...
In DepthDetails ArticlePubMed
TargetD-amino-acid oxidase(Rattus norvegicus (rat))
Shanghai Jiao Tong University
Curated by ChEMBL
LigandPNGBDBM50170228(CHEMBL3804953)
Affinity DataIC50:  2.24E+3nM. Assay description: Inhibition of rat spinal DAAO using D-alanine as substrate assessed as pyruvate production incubated for 60 mins by microplate reader analysis
In DepthDetails ArticlePubMed