BDBM50170268 2-Amino-ethanesulfonic acid {4-[3-(4-tert-butyl-benzyl)-thioureidomethyl]-phenyl}-amide::CHEMBL370055
SMILES CC(C)(C)c1ccc(CNC(=S)NCc2ccc(NS(=O)(=O)CCN)cc2)cc1
InChI Key InChIKey=BIHZJDNFKFQMIZ-UHFFFAOYSA-N
Data  1 KI
  Tab Delimited (TSV)   2D SDfile   Computed 3D by Vconf -m prep SDfile
Find this compound or compounds like it in BindingDB:
Activity Spreadsheet -- Enzyme Inhibition Constant Data from BindingDB
Found 1 hit for monomerid = 50170268
TargetTransient receptor potential cation channel subfamily V member 1(Rattus norvegicus (rat))
Seoul National University
Curated by ChEMBL
LigandPNGBDBM50170268(2-Amino-ethanesulfonic acid {4-[3-(4-tert-butyl-be...)
Affinity DataKi:  4.64E+3nM. Assay description: In vitro binding affinity for rat TRPV1 expressed in CHO cells using [3H]-RTX
In DepthDetails ArticlePubMed