BDBM50170318 1-(2,2-Dimethyl-propyl)-2-methyl-4-propyl-5-{4-[4-(1H-tetrazol-5-yl)-phenoxy]-butoxy}-1H-indole::CHEMBL361724
SMILES CCCc1c(OCCCCOc2ccc(cc2)-c2nnn[nH]2)ccc2n(CC(C)(C)C)c(C)cc12
InChI Key InChIKey=KUWVUYBRCHSNDX-UHFFFAOYSA-N
Data  1 EC50
  Tab Delimited (TSV)   2D SDfile   Computed 3D by Vconf -m prep SDfile
Find this compound or compounds like it in BindingDB:
Activity Spreadsheet -- Enzyme Inhibition Constant Data from BindingDB
Found 1 hit for monomerid = 50170318
TargetMetabotropic glutamate receptor 2(Homo sapiens (Human))
Merck Research Laboratories
Curated by ChEMBL
LigandPNGBDBM50170318(1-(2,2-Dimethyl-propyl)-2-methyl-4-propyl-5-{4-[4-...)
Affinity DataEC50:  559nM. Assay description: Effective concentration for stimulation of [35S]-GTP-gammaS, binding to human metabotropic glutamate receptor 2 incubated at 30 degree C for 1 hr
In DepthDetails ArticlePubMed