BDBM50170384 5-((S)-2-Methoxy-2-phenyl-ethyl)-thiazole-4-carboxylic acid thiazol-2-ylamide::CHEMBL186028
SMILES CO[C@@H](Cc1scnc1C(=O)Nc1nccs1)c1ccccc1
InChI Key InChIKey=GOKCUAGZJCANPH-LBPRGKRZSA-N
Data  2 IC50
  Tab Delimited (TSV)   2D SDfile   Computed 3D by Vconf -m prep SDfile
Find this compound or compounds like it in BindingDB:
Activity Spreadsheet -- Enzyme Inhibition Constant Data from BindingDB
Found 2 hits for monomerid = 50170384
TargetMethionine aminopeptidase(Escherichia coli (strain K12))
Shanghai Graduate School Of The Chinese Academy Of Sciences
Curated by ChEMBL
LigandPNGBDBM50170384(5-((S)-2-Methoxy-2-phenyl-ethyl)-thiazole-4-carbox...)
Affinity DataIC50:  66nM. Assay description: Inhibitory concentration against EcMetAP1 enzyme activity
In DepthDetails ArticlePubMed
TargetMethionine aminopeptidase 1(Saccharomyces cerevisiae)
Shanghai Graduate School Of The Chinese Academy Of Sciences
Curated by ChEMBL
LigandPNGBDBM50170384(5-((S)-2-Methoxy-2-phenyl-ethyl)-thiazole-4-carbox...)
Affinity DataIC50:  450nM. Assay description: Inhibitory concentration against ScMetAP1 enzyme activity
In DepthDetails ArticlePubMed