BDBM50170397 CHEMBL359707::N-[4-(3-Dimethylamino-pyrrolidin-1-yl)-phenyl]-4-oxazol-5-yl-benzamide
SMILES CN(C)C1CCN(C1)c1ccc(NC(=O)c2ccc(cc2)-c2cnco2)cc1
InChI Key InChIKey=PWDIPKVAEZYAIB-UHFFFAOYSA-N
Data  1 KI
  Tab Delimited (TSV)   2D SDfile   Computed 3D by Vconf -m prep SDfile
Find this compound or compounds like it in BindingDB:
Activity Spreadsheet -- Enzyme Inhibition Constant Data from BindingDB
Found 1 hit for monomerid = 50170397
TargetMelanin-concentrating hormone receptor 1(Homo sapiens (Human))
Neurocrine Biosciences
Curated by ChEMBL
LigandPNGBDBM50170397(CHEMBL359707 | N-[4-(3-Dimethylamino-pyrrolidin-1-...)
Affinity DataKi: >1.00E+4nM. Assay description: Binding affinity towards human MCH-R1 evaluated by its ability to displace radioligand [125I]-Tyr13]-MCH
In DepthDetails ArticlePubMed