BDBM50170430 CHEMBL3805228
SMILES Cn1ncc(Cl)c1-c1cc(oc1Cl)C(=O)NC1(CCNCC1)c1ccc(Cl)c(Cl)c1
InChI Key InChIKey=RCHUICFLEWDCEV-UHFFFAOYSA-N
Data  2 IC50
  Tab Delimited (TSV)   2D SDfile   Computed 3D by Vconf -m prep SDfile
Find this compound or compounds like it in BindingDB:
Activity Spreadsheet -- Enzyme Inhibition Constant Data from BindingDB
Found 2 hits for monomerid = 50170430
TargetRAC-alpha serine/threonine-protein kinase(Homo sapiens (Human))
Chinese Academy Of Sciences
Curated by ChEMBL
LigandPNGBDBM50170430(CHEMBL3805228)
Affinity DataIC50:  61nM. Assay description: Inhibition of human Akt1 expressed in Escherichia coli using STK Substrate 2-biotin as substrate incubated for 1 hr by HTRF assay
In DepthDetails ArticlePubMed
TargetRAC-alpha serine/threonine-protein kinase(Homo sapiens (Human))
Chinese Academy Of Sciences
Curated by ChEMBL
LigandPNGBDBM50170430(CHEMBL3805228)
Affinity DataIC50:  61nM. Assay description: Inhibition of Akt1 (unknown origin) expressed in Escherichia coli using peptide substrate after 1 hr by HTRF assay
In DepthDetails ArticlePubMed