BDBM50170643 17-ethyl-3,13-diazapentacyclo[13.3.1.02,10.04,9.013,18]nonadeca-4,6,8-trien-7-yl methyl ether
SMILES CC[C@H]1CC2C[C@H]3C4Nc5ccc(OC)cc5C4CCN(C2)C13
InChI Key InChIKey=MRZGFGZACXZCAM-JJAQNIRASA-N
Data  1 KI
  Tab Delimited (TSV)   2D SDfile   Computed 3D by Vconf -m prep SDfile
Find this compound or compounds like it in BindingDB:
Activity Spreadsheet -- Enzyme Inhibition Constant Data from BindingDB
Found 1 hit for monomerid = 50170643
TargetSigma non-opioid intracellular receptor 1(Homo sapiens (Human))
University Of Innsbruck
Curated by ChEMBL
LigandPNGBDBM50170643(17-ethyl-3,13-diazapentacyclo[13.3.1.02,10.04,9.01...)
Affinity DataKi:  8.55E+3nM. Assay description: Affinity for sigma receptor type 1 of guinea pig using [3H]ifenprodil or (+)-[3H]pentazocine radioligand
Ligand InfoPC cidPC sid
In DepthDetails ArticlePubMed