BDBM50170924 CHEMBL3805346
SMILES N[C@H]1C[C@H](CC[C@@H]1c1cc(F)c(F)cc1F)N1Cc2cnc3nc(nn3c2C1)C1CC1
InChI Key InChIKey=PVWNTNVPPWCQAH-KSMMKXTCSA-N
Data  3 IC50
  Tab Delimited (TSV)   2D SDfile   Computed 3D by Vconf -m prep SDfile
Find this compound or compounds like it in BindingDB:
Activity Spreadsheet -- Enzyme Inhibition Constant Data from BindingDB
Found 3 hits for monomerid = 50170924
TargetDipeptidyl peptidase 8(Homo sapiens (Human))
Merck Research Laboratories
Curated by ChEMBL
LigandPNGBDBM50170924(CHEMBL3805346)
Affinity DataIC50:  3.40E+4nM. Assay description: Inhibition of DPP8 (unknown origin)
In DepthDetails ArticlePubMed
TargetAcyl-protein thioesterase 1(Rattus norvegicus)
Merck Research Laboratories
Curated by ChEMBL
LigandPNGBDBM50170924(CHEMBL3805346)
Affinity DataIC50:  570nM. Assay description: Inhibition of human FAP
In DepthDetails ArticlePubMed
TargetDipeptidyl peptidase 4(Homo sapiens (Human))
Merck Research Laboratories
Curated by ChEMBL
LigandPNGBDBM50170924(CHEMBL3805346)
Affinity DataIC50:  1.70nM. Assay description: Inhibition of human DPP4
In DepthDetails ArticlePubMed