BDBM50170977 3,5-Dichloro-N-[4-((S)-2-{[(S)-1-(3,5-dichloro-benzenesulfonyl)-pyrrolidine-2-carbonyl]-amino}-2-1H-tetrazol-5-yl-ethyl)-phenyl]-isonicotinamide::CHEMBL190761
SMILES Clc1cc(Cl)cc(c1)S(=O)(=O)N1CCC[C@H]1C(=O)N[C@@H](Cc1ccc(NC(=O)c2c(Cl)cncc2Cl)cc1)c1nnn[nH]1
InChI Key InChIKey=ORFQNZZESZKMDH-VXKWHMMOSA-N
Data  1 IC50
  Tab Delimited (TSV)   2D SDfile   Computed 3D by Vconf -m prep SDfile
Find this compound or compounds like it in BindingDB:
Activity Spreadsheet -- Enzyme Inhibition Constant Data from BindingDB
Found 1 hit for monomerid = 50170977
TargetIntegrin alpha-4/beta-1(Homo sapiens (Human))
Merck Research Laboratories
Curated by ChEMBL
LigandPNGBDBM50170977(3,5-Dichloro-N-[4-((S)-2-{[(S)-1-(3,5-dichloro-ben...)
Affinity DataIC50:  60nM. Assay description: Inhibition of VLA-4 receptor of Jurkat cells in BURJ assay
In DepthDetails ArticlePubMed