BDBM50170989 (S)-4-[(S)-4-(R)-Carbamoyl-1-(4-carboxymethoxy-benzyl)-6-methyl-2-oxo-heptylcarbamoyl]-4-(3-naphthalen-1-yl-propionylamino)-butyric acid benzyl ester::CHEMBL366342
SMILES CC(C)C[C@H](CC(=O)[C@H](Cc1ccc(OCC(O)=O)cc1)NC(=O)[C@H](CCC(=O)OCc1ccccc1)NC(=O)CCc1cccc2ccccc12)C(N)=O
InChI Key InChIKey=IEHOBHDFLKBKNW-HTVAGRJCSA-N
Data  2 IC50
  Tab Delimited (TSV)   2D SDfile   Computed 3D by Vconf -m prep SDfile
Find this compound or compounds like it in BindingDB:
Activity Spreadsheet -- Enzyme Inhibition Constant Data from BindingDB
Found 2 hits for monomerid = 50170989
TargetProtein-tyrosine-phosphatase(Yersinia pestis)
Nih
Curated by ChEMBL
LigandPNGBDBM50170989((S)-4-[(S)-4-(R)-Carbamoyl-1-(4-carboxymethoxy-ben...)
Affinity DataIC50:  1.80E+4nM. Assay description: Inhibitory concentration against Yersinia pestis YopH expressed in Escherichia coli BL21 cells
In DepthDetails ArticlePubMed
TargetTyrosine-protein phosphatase non-receptor type 1(Homo sapiens (Human))
Nih
Curated by ChEMBL
LigandPNGBDBM50170989((S)-4-[(S)-4-(R)-Carbamoyl-1-(4-carboxymethoxy-ben...)
Affinity DataIC50:  1.20E+4nM. Assay description: Inhibitory concentration against human PTP1B expressed in Escherichia coli BL21 cells
In DepthDetails ArticlePubMed