BDBM50170993 CHEMBL364349::{4-[(S)-2-[3-Benzyloxycarbonylamino-2-(benzyloxycarbonylamino-methyl)-propionylamino]-2-((S)-1-carbamoyl-3-methyl-butylcarbamoyl)-ethyl]-phenoxy}-acetic acid
SMILES CC(C)C[C@H](NC(=O)[C@H](Cc1ccc(OCC(O)=O)cc1)NC(=O)C(CNC(=O)OCc1ccccc1)CNC(=O)OCc1ccccc1)C(N)=O
InChI Key InChIKey=TWLUQWINUCUWAC-CONSDPRKSA-N
Data  2 IC50
  Tab Delimited (TSV)   2D SDfile   Computed 3D by Vconf -m prep SDfile
Find this compound or compounds like it in BindingDB:
Activity Spreadsheet -- Enzyme Inhibition Constant Data from BindingDB
Found 2 hits for monomerid = 50170993
TargetProtein-tyrosine-phosphatase(Yersinia pestis)
Nih
Curated by ChEMBL
LigandPNGBDBM50170993(CHEMBL364349 | {4-[(S)-2-[3-Benzyloxycarbonylamino...)
Affinity DataIC50:  4.00E+3nM. Assay description: Inhibitory concentration against Yersinia pestis YopH expressed in Escherichia coli BL21 cells
In DepthDetails ArticlePubMed
TargetTyrosine-protein phosphatase non-receptor type 1(Homo sapiens (Human))
Nih
Curated by ChEMBL
LigandPNGBDBM50170993(CHEMBL364349 | {4-[(S)-2-[3-Benzyloxycarbonylamino...)
Affinity DataIC50:  2.80E+3nM. Assay description: Inhibitory concentration against human PTP1B expressed in Escherichia coli BL21 cells
In DepthDetails ArticlePubMed