BDBM50171062 (5'-Ethoxy-[2,3']bipyridinyl-6'-yl)-(6-methyl-pyridin-2-yl)-amine::CHEMBL382715
SMILES CCOc1cc(cnc1Nc1cccc(C)n1)-c1ccccn1
InChI Key InChIKey=GZZWOVOSKRZICU-UHFFFAOYSA-N
Data  1 IC50
  Tab Delimited (TSV)   2D SDfile   Computed 3D by Vconf -m prep SDfile
Find this compound or compounds like it in BindingDB:
Activity Spreadsheet -- Enzyme Inhibition Constant Data from BindingDB
Found 1 hit for monomerid = 50171062
TargetMetabotropic glutamate receptor 5(Homo sapiens (Human))
Merck Research Laboratories
Curated by ChEMBL
LigandPNGBDBM50171062((5'-Ethoxy-[2,3']bipyridinyl-6'-yl)-(6-methyl-pyri...)
Affinity DataIC50:  193nM. Assay description: In vitro potency against calcium flux in Ltk cells expressing human recombinant metabotropic glutamate receptor 5 using fluorescence detection
In DepthDetails ArticlePubMed