BDBM50171072 (3-Benzyloxy-pyridin-2-yl)-(6-methyl-pyridin-2-yl)-amine::CHEMBL197927
SMILES Cc1cccc(Nc2ncccc2OCc2ccccc2)n1
InChI Key InChIKey=OOQQSPQZOGECBR-UHFFFAOYSA-N
Data  1 IC50
  Tab Delimited (TSV)   2D SDfile   Computed 3D by Vconf -m prep SDfile
Find this compound or compounds like it in BindingDB:
Activity Spreadsheet -- Enzyme Inhibition Constant Data from BindingDB
Found 1 hit for monomerid = 50171072
TargetMetabotropic glutamate receptor 5(Homo sapiens (Human))
Merck Research Laboratories
Curated by ChEMBL
LigandPNGBDBM50171072((3-Benzyloxy-pyridin-2-yl)-(6-methyl-pyridin-2-yl)...)
Affinity DataIC50:  870nM. Assay description: In vitro potency against calcium flux in Ltk cells expressing human recombinant metabotropic glutamate receptor 5 using fluorescence detection
In DepthDetails ArticlePubMed